2-Methylpropyl (E)-isoferulate, TMS

Van Den Dool and Kratz RI, non-polar column, temperature ramp

View large format table.

Column type Active phase I Reference Comment
CapillaryDB-12149.Greenaway, Wollenweber, et al., 198830. m/0.32 mm/0.25 μm, He, 3. K/min; Tstart: 75. C; Tend: 300. C

References

Greenaway, Wollenweber, et al., 1988
Greenaway, W.; Wollenweber, E.; Scaysbrook, T.; Whatley, F.R., Novel isoferulate esters identified by gas chromatography-mass spectrometry in bud exudate of Populus nigra, J. Chromatogr., 1988, 448, 284-290, https://doi.org/10.1016/S0021-9673(01)84590-8 . [all data]