1,2,4,5,7,8-hexaoxacyclononane, 3,3-dimethyl, 6,6,9,9-tetraethyl

Van Den Dool and Kratz RI, non-polar column, temperature ramp

View large format table.

Column type Active phase I Reference Comment
CapillaryDB-51404.8Barreto, Cañizo, et al., 200630. m/0.32 mm/0.25 μm, N2, 60. C @ 5. min, 10. K/min; Tend: 300. C
CapillaryDB-51410.3Barreto, Cañizo, et al., 200630. m/0.32 mm/0.25 μm, N2, 60. C @ 5. min, 20. K/min; Tend: 300. C
CapillaryDB-51413.9Barreto, Cañizo, et al., 200630. m/0.32 mm/0.25 μm, N2, 60. C @ 5. min, 5. K/min; Tend: 300. C
CapillaryRTX-5 MS1418.Barreto, Cañizo, et al., 200630. m/0.25 mm/0.25 μm, He, 60. C @ 5. min, 10. K/min; Tend: 300. C
CapillaryRTX-5 MS1420.9Barreto, Cañizo, et al., 200630. m/0.25 mm/0.25 μm, He, 60. C @ 5. min, 20. K/min; Tend: 300. C
CapillaryRTX-5 MS1418.4Barreto, Cañizo, et al., 200630. m/0.25 mm/0.25 μm, He, 60. C @ 5. min, 5. K/min; Tend: 300. C
CapillaryRTX-5 MS1421.7Barreto, Cañizo, et al., 200630. m/0.25 mm/0.25 μm, He, 10. K/min; Tstart: 60. C; Tend: 300. C

References

Barreto, Cañizo, et al., 2006
Barreto, G.P.; Cañizo, A.I.; Eyler, G.N., Use of Retention Data as the First Step in the Identification of Cyclic Organic Peroxides in Temperature-Programmed Gas Chromatography, Chromatographia, 2006, 63, 5-6, 261-266, https://doi.org/10.1365/s10337-006-0716-y . [all data]