[3aS-[3aα,3bβ,4β,7α7aS*]]-Octahydro-7-methyl-3-methylene-4-[1-methylethyl]1Hcyclopenta[1,3]cyclopropa[1,2]-benzene

Van Den Dool and Kratz RI, non-polar column, temperature ramp

View large format table.

Column type Active phase I Reference Comment
CapillaryHP-5MS1477.4Zhao, Liang, et al., 200530. m/0.25 mm/0.25 μm, He, 2. K/min; Tstart: 80. C; Tend: 290. C
CapillaryHP-5MS1486.Zhao, Liang, et al., 200530. m/0.25 mm/0.25 μm, He, 4. K/min; Tstart: 80. C; Tend: 290. C
CapillaryHP-5MS1491.7Zhao, Liang, et al., 200530. m/0.25 mm/0.25 μm, He, 6. K/min; Tstart: 80. C; Tend: 290. C

References

Zhao, Liang, et al., 2005
Zhao, C.-X.; Liang, Y.-Z.; Fang, H.-Z.; Li, X.-N., Temperature-programmed retention indices for gas chromatography-mass spectroscopy analysis of plant essential oils, J. Chromatogr. A, 2005, 1096, 1-2, 76-85, https://doi.org/10.1016/j.chroma.2005.09.067 . [all data]