N-benzylpiperazine, TFA

Normal alkane RI, non-polar column, temperature ramp

View large format table.

Column type Active phase I Reference Comment
CapillaryDB-5MS1718.Tsutsumi, Katagi, et al., 200530. m/0.25 mm/0.25 μm, He, 80. C @ 1. min, 10. K/min; Tend: 250. C

References

Tsutsumi, Katagi, et al., 2005
Tsutsumi, H.; Katagi, M.; Miki, A.; Shima, N.; Kamata, T.; Nishikawa, M.; Nakajima, K.; Tsuchihashi, H., Development of simultaneous gas chromatography-mass spectrometric and liquid chromatography-electrospray ionization mass spectrometric determination method for the new designer drugs, N-benzylpiperazine (BZP), 1-(3-trifluoromethylphenyl)piperazine (TFMPP) and their main metabolites in urine, J. Chromatogr. B, 2005, 819, 315-322. [all data]