Tritriacont-9-ene

Van Den Dool and Kratz RI, non-polar column, temperature ramp

View large format table.

Column type Active phase I Reference Comment
CapillaryDB-5MS3277.Steiner, Steidle, et al., 200530. m/0.32 mm/0.25 μm, He, 2. K/min; Tstart: 150. C; Tend: 300. C

References

Steiner, Steidle, et al., 2005
Steiner, S.; Steidle, J.L.M.; Ruther, J., Female sex pheromone in immature insect males - a case of pre-emergence chemical mimicry?, Behavioral Ecology and Sociobiology, 2005, 58, 2, 111-120, https://doi.org/10.1007/s00265-005-0930-x . [all data]