cis-7,8-epoxy-2-methyl-E4-octadecene

Van Den Dool and Kratz RI, non-polar column, custom temperature program

Data compiled by: NIST Mass Spectrometry Data Center, William E. Wallace, director

Column type Capillary
Active phase DB-5
Column length (m) 30.
Carrier gas
Substrate
Column diameter (mm) 0.25
Phase thickness (μm)
Program not specified
I 2021.
ReferenceGries R., Khaskin G., et al., 2005
Comment MSDC-RI

References

Gries R., Khaskin G., et al., 2005
Gries R.; Khaskin G.; Schaefer P.; Hahn R.; Gotoh T.; Gries G., (7R,8S)-cis-7,8-epoxy-2-methyloctadec-17-ene: A novel trace component from the sex pheromone gland of gypsy moth, Lymantria dispar, J. Chem. Ecol., 2005, 31, 1, 49-62, https://doi.org/10.1007/s10886-005-0973-5 . [all data]