2,11-Diacetoxyheptadecane

Van Den Dool and Kratz RI, non-polar column, temperature ramp

View large format table.

Column type Active phase I Reference Comment
CapillaryDB-52269.Gries R., Khaskin G., et al., 2005100. C @ 1. min, 15. K/min; Tend: 280. C

References

Gries R., Khaskin G., et al., 2005
Gries R.; Khaskin G.; Bennett R.G.; Miroshnychenko A.; Burden K.; Gries G., (S,S)-2,12-, (S,S)-2,13-, and (S,S)-2,14-diacetoxyheptadecanes: Sex pheromone components of red cedar cone midge, Mayetiola thujae, J. Chem. Ecol., 2005, 31, 12, 2933-2946, https://doi.org/10.1007/s10886-005-8405-0 . [all data]