2,5-Bis(1-bromo-1-methylethyl)pyrazine

Normal alkane RI, non-polar column, temperature ramp

View large format table.

Column type Active phase I Reference Comment
CapillaryBPX-51718.Dickschat, Reichenbach, et al., 200525. m/0.22 mm/0.25 μm, He, 50. C @ 5. min, 5. K/min; Tend: 320. C

References

Dickschat, Reichenbach, et al., 2005
Dickschat, J.S.; Reichenbach, H.; Wagner-Döbler, I.; Schulz, S., Novel Pyrazines from the Myxobacterium Chondromyces crocatus and Marine Bacteria, Eur. J. Org. Chem., 2005, 2005, 19, 4141-4153, https://doi.org/10.1002/ejoc.200500280 . [all data]