1,10-Diiodoperfluorodecane

Kovats' RI, non-polar column, isothermal

View large format table.

Column type Active phase Temperature (C) I Reference Comment
CapillaryOV-101140.1254.Boneva and Kotov, 1988Column length: 100. m; Column diameter: 0.27 mm
CapillaryOV-101150.1244.Boneva and Kotov, 1988Column length: 100. m; Column diameter: 0.27 mm
CapillaryOV-101160.1243.Boneva and Kotov, 1988Column length: 100. m; Column diameter: 0.27 mm

References

Boneva and Kotov, 1988
Boneva, S.; Kotov, St., Separation and Identification of α,ω-Diidoperfluoroalkanes in Gas Chromatography, Chromatographia, 1988, 25, 8, 735-736, https://doi.org/10.1007/BF02290482 . [all data]