Guaiacyl hexanoate

Normal alkane RI, non-polar column, temperature ramp

View large format table.

Column type Active phase I Reference Comment
CapillaryDB-11681.Tohar, Mohd, et al., 200630. m/0.32 mm/0.25 μm, 60. C @ 3. min, 3. K/min, 230. C @ 10. min

Normal alkane RI, non-polar column, custom temperature program

View large format table.

Column type Active phase I Reference Comment
CapillarySE-301681.Vinogradov, 2004Program: not specified

Normal alkane RI, polar column, custom temperature program

View large format table.

Column type Active phase I Reference Comment
CapillaryCarbowax 20M2296.Vinogradov, 2004Program: not specified

References

Tohar, Mohd, et al., 2006
Tohar, N.; Mohd, M.A.; Jantan, I.; Awang, K., A comparative study of the essential oils of the genus Plumeria Linn. from Malaysia, Flavour Fragr. J., 2006, 21, 6, 859-863, https://doi.org/10.1002/ffj.1617 . [all data]

Vinogradov, 2004
Vinogradov, B.A., Production, composition, properties and application of essential oils, 2004, retrieved from http://viness.narod.ru. [all data]