Myli-4(15)-ene

Van Den Dool and Kratz RI, non-polar column, temperature ramp

View large format table.

Column type Active phase I Reference Comment
CapillaryCP Sil 5 CB1419.von Reuss, Wu, et al., 2004H2, 3. K/min; Column length: 25. m; Tstart: 50. C; Tend: 230. C

References

von Reuss, Wu, et al., 2004
von Reuss, S.H.; Wu, C.-L.; Muhle, H.; König, W.A., Sesquiterpene constituents from the essential oils of the liverworts Mylia taylorii and Mylia nuda, Phytochemistry, 2004, 65, 15, 2277-2291, https://doi.org/10.1016/j.phytochem.2004.04.039 . [all data]