10-Docosene

Van Den Dool and Kratz RI, non-polar column, custom temperature program

View large format table.

Column type Active phase I Reference Comment
CapillaryMethyl Silicone2160.Kaib, Jmhasly, et al., 2004Program: 80C(1.5min) =.40C/min => 160C => 2.5C/min => 280C

References

Kaib, Jmhasly, et al., 2004
Kaib, M.; Jmhasly, P.; Wilfert, L.; Durka, W.; Franke, S.; Francke, W.; Leuthold, R.H.; Brandl, R., Cuticular hydrocarbons and aggression in the termite Macrotermes Subhyalinus, J. Chem. Ecol., 2004, 30, 2, 365-385, https://doi.org/10.1023/B:JOEC.0000017983.89279.c5 . [all data]