1,3-Cyclopentadiene, 1-(1-methylethyl)

Kovats' RI, non-polar column, isothermal

View large format table.

Column type Active phase Temperature (C) I Reference Comment
CapillarySqualane64.788.Sojak, Ruman, et al., 198750. m/0.25 mm/0.25 μm, H2

References

Sojak, Ruman, et al., 1987
Sojak, L.; Ruman, J.; Janak, J., Characterization of Monoalkylcyclopentadiens by Retention-Structure Correlation in Capillary Gas Chromatography, J. Chromatogr., 1987, 391, 79-87, https://doi.org/10.1016/S0021-9673(01)94306-7 . [all data]