Eicosyl 4-methylpentanoate

Normal alkane RI, non-polar column, custom temperature program

View large format table.

Column type Active phase I Reference Comment
CapillaryHP-12733.Wakamura, Arakaki, et al., 200115. m/0.25 mm/0.25 μm; Program: 50 0C (1 min) 20 K/min -> 150 0C 5 K/min -> 280 0C (5 min)

References

Wakamura, Arakaki, et al., 2001
Wakamura, S.; Arakaki, N.; Ono, H.; Yasui, H., Identification of novel sex pheromone components from a tussock moth, Euproctis pulverea, Entomol. Exp. Appl., 2001, 100, 1, 109-117, https://doi.org/10.1046/j.1570-7458.2001.00853.x . [all data]