Glycerol, 1-iso-C14, 2-ai-C15, TMS

Normal alkane RI, non-polar column, custom temperature program

View large format table.

Column type Active phase I Reference Comment
CapillaryCP Sil 5 CB3375.Pancost, Bouloubassi, et al., 200125. m/0.32 mm/0.12 μm, He; Program: 70 0C 20 K/min -> 130 0C 4 K/min -> 320 0C (15 min)

References

Pancost, Bouloubassi, et al., 2001
Pancost, R.D.; Bouloubassi, I.; Aloisi, G.; Damsté, J.S.S.; Medinout Shipboard Scientific Party, Three series of non-isoprenoidal dialkyl glycerol diethers in cold-seep carbonate crusts, Org. Geochem., 2001, 32, 5, 695-707, https://doi.org/10.1016/S0146-6380(01)00015-8 . [all data]