Triphenylmethane, 2,2'-dichloro

Lee's RI, non-polar column, temperature ramp

Data compiled by: NIST Mass Spectrometry Data Center, William E. Wallace, director

Column type Capillary
Active phase BPX-5
Column length (m) 50.
Carrier gas He
Substrate
Column diameter (mm) 0.25
Phase thickness (μm) 0.25
Tstart (C) 50.
Tend (C) 300.
Heat rate (K/min) 3.
Initial hold (min) 3.
Final hold (min)
I 376.5
ReferenceSchwarzbauer, Franke, et al., 1999
Comment MSDC-RI

References

Schwarzbauer, Franke, et al., 1999
Schwarzbauer, J.; Franke, S.; Francke, W., Chlorinated di- and triphenylmethanes in sediments of the Mulde and Elbe rivers. Part IV of organic compounds as contaminants of the Elbe river and its tributaries, Fresenius J. Anal. Chem., 1999, 365, 6, 529-536, https://doi.org/10.1007/s002160051517 . [all data]