2-Methoxyethyl-undec-10-enoate

Normal alkane RI, non-polar column, temperature ramp

View large format table.

Column type Active phase I Reference Comment
CapillaryDB-11421.Dudda and Spiteller, 199630. m/0.32 mm/0.1 μm, H2, 3. K/min; Tstart: 80. C; Tend: 280. C

References

Dudda and Spiteller, 1996
Dudda, A.; Spiteller, G., Structure and origin of artifacts in the analysis of plasmalogens, J. Mass Spectrom., 1996, 31, 3, 303-308, https://doi.org/10.1002/(SICI)1096-9888(199603)31:3<303::AID-JMS304>3.0.CO;2-5 . [all data]