t,t-cycloundeca-1,5-diene

Kovats' RI, non-polar column, isothermal

View large format table.

Column type Active phase Temperature (C) I Reference Comment
CapillaryOV-1100.1177.6Engewald, Billing, et al., 1987Column length: 50. m; Column diameter: 0.3 mm

References

Engewald, Billing, et al., 1987
Engewald, W.; Billing, U.; Welsch, T.; Haufe, G., Structure-retention correlations of hydrocarbons in gas-liquid and gas-solid chromatography. Cycloalkenes and cycloalkadienes, Chromatographia, 1987, 23, 8, 590-594, https://doi.org/10.1007/BF02324870 . [all data]