[2H7]-2,3,5-Trichloro-1,4-dimethylbenzene

Kovats' RI, non-polar column, isothermal

View large format table.

Column type Active phase Temperature (C) I Reference Comment
CapillarySE-54115.1416.Bermejo, Blanco, et al., 1986N2; Column length: 25. m; Column diameter: 0.22 mm
CapillarySqualane115.1390.Bermejo, Blanco, et al., 1986N2; Column length: 45. m; Column diameter: 0.5 mm

References

Bermejo, Blanco, et al., 1986
Bermejo, J.; Blanco, C.G.; Guillén, M.D., Gas chromatography of deuterated and protiated chloro derivatives of 1,4-dimethylbenzene, J. Chromatogr., 1986, 351, 425-432, https://doi.org/10.1016/S0021-9673(01)83520-2 . [all data]