Butethal perethylated

Kovats' RI, non-polar column, isothermal

View large format table.

Column type Active phase Temperature (C) I Reference Comment
PackedSE-30180.1644.Gambaro, Mariani, et al., 1982Gas Chrom P (100-120 mesh); Column length: 1.8 m

References

Gambaro, Mariani, et al., 1982
Gambaro, V.; Mariani, R.; Marozzi, E., Flash alkylation for the identification of barbiturates in biological material, J. Anal. Toxicol., 1982, 6, 6, 321-323, https://doi.org/10.1093/jat/6.6.321 . [all data]