m-Hydroxymandelic acid, TFA-ME

Kovats' RI, non-polar column, isothermal

View large format table.

Column type Active phase Temperature (C) I Reference Comment
PackedOV-101170.1320.Midgley, Couch, et al., 1979Chromosorb GHP; Column length: 1.8 m

References

Midgley, Couch, et al., 1979
Midgley, J.M.; Couch, M.W.; Crowley, J.R.; Williams, C.M., Identification and Quantitative Determination of o- and m-Hydroxymandelic Acid in Human Urine, Biomed. Mass Spectrom., 1979, 6, 11, 485-490, https://doi.org/10.1002/bms.1200061106 . [all data]