2-hydroxy-2-methylpropyl glucosinolate, TMS

Kovats' RI, non-polar column, isothermal

View large format table.

Column type Active phase Temperature (C) I Reference Comment
PackedSE-52230.2551.Underhill and Kirkland, 1971DMCS-treated Chromosorb G; Column length: 2. m

References

Underhill and Kirkland, 1971
Underhill, E.W.; Kirkland, D.F., Gas chromatography of trimethylsilyl derivatives of glucosinolates, J. Chromatogr., 1971, 57, 47-54, https://doi.org/10.1016/0021-9673(71)80005-5 . [all data]