Fluoranthene, 3,8-dinitro

Lee's RI, non-polar column, temperature ramp

View large format table.

Column type Active phase I Reference Comment
CapillaryDB-5486.3Ramdahl, Arey, et al., 19868. K/min; Column length: 57. m; Tstart: 50. C; Tend: 320. C

References

Ramdahl, Arey, et al., 1986
Ramdahl, Th.; Arey, J.; Zielinska, B.; Atkinson, R.; Winer, A.M., Analysis of dinitrofluoranthenes by high resolution capillary gas chromatography/mass spectrometry, J. Hi. Res. Chromatogr. Chromatogr. Comm., 1986, 9, 9, 515-517, https://doi.org/10.1002/jhrc.1240090905 . [all data]