(2E,6E)-Methyl-10-hydroxy-3,7,11-trimethyldodeca-2,6,11-trienoate

Kovats' RI, non-polar column, temperature ramp

View large format table.

Column type Active phase I Reference Comment
CapillaryCP Sil 5 CB2017.Ogunwande, Olawore, et al., 200425. m/0.25 mm/0.15 μm, H2, 3. K/min; Tstart: 50. C; Tend: 230. C

References

Ogunwande, Olawore, et al., 2004
Ogunwande, I.A.; Olawore, N.O.; Adeleke, K.A.; Ekundayo, O.; König, W.A., Rare terpenoid esters from Hyparrhenia rufa (Nees) Stapf. growing wild in Nigeria, Flavour Fragr. J., 2004, 19, 3, 239-243, https://doi.org/10.1002/ffj.1295 . [all data]