8,9,10-trinorborn-5-ene-2-spiro-1'-(2'-(2-methylbutanoyloxy)cyclohexane)

Kovats' RI, non-polar column, isothermal

View large format table.

Column type Active phase Temperature (C) I Reference Comment
CapillaryMethyl Silicone190.1798.9Boneva and Skumov, 199950. m/0.25 mm/1. μm
CapillaryMethyl Silicone200.1806.3Boneva and Skumov, 199950. m/0.25 mm/1. μm

Kovats' RI, polar column, isothermal

View large format table.

Column type Active phase Temperature (C) I Reference Comment
CapillaryCarbowax 20M190.2211.2Boneva and Skumov, 199950. m/0.32 mm/0.3 μm
CapillaryCarbowax 20M200.2224.Boneva and Skumov, 199950. m/0.32 mm/0.3 μm

References

Boneva and Skumov, 1999
Boneva, S.; Skumov, M., Gas chromatography of tricyclic spiro esters, Chromatographia, 1999, 49, 7/8, 115-118. [all data]