12-Chlorooctadecanoic acid, methyl ester

Kovats' RI, non-polar column, isothermal

View large format table.

Column type Active phase Temperature (C) I Reference Comment
CapillarySE-30180.2317.Haken and Korhonen, 1984N2; Column length: 25. m; Column diameter: 0.22 mm
CapillarySE-30200.2318.Haken and Korhonen, 1984N2; Column length: 25. m; Column diameter: 0.22 mm

Kovats' RI, polar column, isothermal

View large format table.

Column type Active phase Temperature (C) I Reference Comment
CapillaryCarbowax 20M180.2773.Haken and Korhonen, 1984N2; Column length: 22. m; Column diameter: 0.3 mm
CapillaryCarbowax 20M200.2762.Haken and Korhonen, 1984N2; Column length: 22. m; Column diameter: 0.3 mm

References

Haken and Korhonen, 1984
Haken, J.K.; Korhonen, I.O.O., Gas chromatography of homologous esters. XXV. Capillary column studies of monochlorinated C5-C18 n-carboxylic esters, J. Chromatogr., 1984, 298, 89-100, https://doi.org/10.1016/S0021-9673(01)92697-4 . [all data]