Propanoic acid, 3-bromo-2-chloro, 3-methylbutyl ester

Kovats' RI, non-polar column, isothermal

Data compiled by: NIST Mass Spectrometry Data Center, William E. Wallace, director

Column type Capillary
Active phase OV-101
Column length (m) 19.
Carrier gas N2
Substrate
Column diameter (mm) 0.28
Phase thickness (μm)
Temperature (C) 100.
I 1311.
ReferenceHorna, Táborský, et al., 1985
Comment MSDC-RI

References

Horna, Táborský, et al., 1985
Horna, A.; Táborský, J.; Churácek, J.; Dufka, O., Chromatography of monomers. IV. Gas-liquid chromatographic studies of C1-C6 n-alkyl and C3-C6 isoalkyl acrylates and their hydrogen halide and halogen addition derivatives, J. Chromatogr., 1985, 348, 141-149, https://doi.org/10.1016/S0021-9673(01)92447-1 . [all data]