2-hydroxyl-3,4,6-trimethoxy-acetophenone

Normal alkane RI, non-polar column, temperature ramp

View large format table.

Column type Active phase I Reference Comment
CapillaryCP Sil 5 CB1785.Rycroft, Cole, et al., 199825. m/0.32 mm/0.12 μm, He, 80. C @ 2. min, 5. K/min, 275. C @ 10. min

References

Rycroft, Cole, et al., 1998
Rycroft, D.S.; Cole, W.J.; Rong, S., Highly oxygenated naphthalenes and acetophenones from the liverwort Adelanthus Decipiens from the British Isles and South America, Phytochemistry, 1998, 48, 8, 1351-1356, https://doi.org/10.1016/S0031-9422(97)00806-6 . [all data]