6,10,14-trimethyloctadecane

Normal alkane RI, non-polar column, temperature ramp

View large format table.

Column type Active phase I Reference Comment
CapillaryCP Sil 5 CB1928.Höld, Schouten, et al., 199825. m/0.32 mm/0.45 μm, 0. C @ 5. min, 3. K/min, 300. C @ 10. min

References

Höld, Schouten, et al., 1998
Höld, I.M.; Schouten, S.; van Kaam-Peters, H.M.E.; Sinninghe Damsté, J.S., Recognition of n-alkyl and isoprenoid algaenans in marine sediments by stable carbon isotopic analysis of pyrolysis products of kerogens, Org. Geochem., 1998, 28, 3-4, 179-194, https://doi.org/10.1016/S0146-6380(97)00130-7 . [all data]