Tricyclo[5.2.1.0(2.6)]deca-3,8-diene, 3,9-dimethyl

Kovats' RI, non-polar column, isothermal

View large format table.

Column type Active phase Temperature (C) I Reference Comment
CapillaryOV-101100.1159.9Diez, Guillen, et al., 1990N2; Column length: 25. m; Column diameter: 0.23 mm
CapillaryOV-10180.1149.6Diez, Guillen, et al., 1990N2; Column length: 25. m; Column diameter: 0.23 mm
CapillarySqualane100.1138.4Diez, Guillen, et al., 1990N2; Column length: 45. m; Column diameter: 0.5 mm
CapillarySqualane80.1130.4Diez, Guillen, et al., 1990N2; Column length: 45. m; Column diameter: 0.5 mm
CapillarySE-54100.1174.Diez, Guillen, et al., 1990N2; Column length: 25. m; Column diameter: 0.22 mm
CapillarySE-5480.1163.5Diez, Guillen, et al., 1990N2; Column length: 25. m; Column diameter: 0.22 mm

References

Diez, Guillen, et al., 1990
Diez, M.A.; Guillen, M.D.; Blanco, C.G.; Bermejo, J., Chromatographic study of methylcyclopentadiene dimers and iso-dimers and determination of their boiling points, J. Chromatogr., 1990, 508, 363-374, https://doi.org/10.1016/S0021-9673(00)91279-2 . [all data]