5-[2-(4-Allyl-2,6-dimethoxy-phenoxy)-1-hydroxy-propyl]-2-methoxy-phenol, TES

Normal alkane RI, non-polar column, temperature ramp

View large format table.

Column type Active phase I Reference Comment
PackedSE-303310.Harvey, 1975N2, Gas-Chrom Q, 4. K/min, 330. C @ 30. min; Column length: 2. m; Tstart: 150. C

References

Harvey, 1975
Harvey, D.J., Examination of the diphenylpropanoids of nutmeg as their trimethylsilyl, triethylsilyl and tri-n-propylsilyl derivatives using combined gas chromatography and mass spectrometry, J. Chromatogr., 1975, 110, 1, 91-102, https://doi.org/10.1016/S0021-9673(00)91214-7 . [all data]