2-phenyl-4-isobutyl-tetrahydro-1,4-oxazine

Kovats' RI, non-polar column, isothermal

View large format table.

Column type Active phase Temperature (C) I Reference Comment
PackedApiezon L + KOH175.1699.12Bondivenne and Busch, 1968Chromosorb W
PackedApiezon L + KOH200.1698.64Bondivenne and Busch, 1968Chromosorb W
PackedApiezon L + KOH225.1695.55Bondivenne and Busch, 1968Chromosorb W

References

Bondivenne and Busch, 1968
Bondivenne, R.; Busch, N., Establishment and study of retention indices of members of a homologous series, 2-phenyl-4-alkyl-tetrahydro-1, 4-oxazines. III. Study of the behavior of several isomers, J. Gas Chromatogr., 1968, 6, 11, 548-550, https://doi.org/10.1093/chromsci/6.11.548 . [all data]