R,S-3',4'-methylenedioxy-α-pyrrolidinopropiophenone-M (desmethylene-desamino-oxo-), diethylated

Kovats' RI, non-polar column, temperature ramp

View large format table.

Column type Active phase I Reference Comment
CapillaryHP-11720.Springer, Fritschi, et al., 200312. m/0.2 mm/0.33 μm, He, 100. C @ 3. min, 30. K/min, 310. C @ 8. min

References

Springer, Fritschi, et al., 2003
Springer, D.; Fritschi, G.; Maurer, H.H., Metabolism and toxicological detection of the new designer drug 3',4'-methylenedioxy-α-pyrrolidinopropiophenone studied in urine using gas chromatography-mass spectrometry, J. Chromatogr. B, 2003, 793, 2, 377-388, https://doi.org/10.1016/S1570-0232(03)00350-7 . [all data]