7-Nonadecene

Kovats' RI, non-polar column, isothermal

View large format table.

Column type Active phase Temperature (C) I Reference Comment
CapillaryDB-1230.1879.09Stránský, Valterová, et al., 200130. m/0.25 mm/0.25 μm, H2

References

Stránský, Valterová, et al., 2001
Stránský, K.; Valterová, I.; Fiedler, P., Nonsaponifiable lipid components of the pollen of elder (Sambucus nigra L.), J. Chromatogr. A, 2001, 936, 1-2, 173-181, https://doi.org/10.1016/S0021-9673(01)01313-9 . [all data]