Propyl N-methyl carbamate

Kovats' RI, non-polar column, isothermal

View large format table.

Column type Active phase Temperature (C) I Reference Comment
PackedSE-3060.965.Gudovicheva and Boitsov, 1985Column length: 100. m

Kovats' RI, polar column, isothermal

View large format table.

Column type Active phase Temperature (C) I Reference Comment
PackedPEG 400060.1501.Gudovicheva and Boitsov, 1985N2, Inerton AW (0.16-0.20 mm); Column length: 1. m

References

Gudovicheva and Boitsov, 1985
Gudovicheva, N.N.; Boitsov, E.N., Gas-liquid chromatography of secondary carbamates, Zh. Anal. Khim., 1985, 40, 8, 1521-1524. [all data]