α-methyl-N-(1-phenylethyl)-benzenethanamine, N-methyl

Normal alkane RI, non-polar column, temperature ramp

View large format table.

Column type Active phase I Reference Comment
CapillarySPB-11847.Blachut, Czarnocki, et al., 200125. m/0.25 mm/0.25 μm, He, 10. K/min; Tstart: 100. C; Tend: 290. C
CapillarySPB-11855.Blachut, Czarnocki, et al., 200125. m/0.25 mm/0.25 μm, He, 10. K/min; Tstart: 100. C; Tend: 290. C

References

Blachut, Czarnocki, et al., 2001
Blachut, D.; Czarnocki, Z.; Wojtasiewicz, K., α-Phenylethylamine in illegally produced amphetamine, Forensic Sci. Int., 2001, 123, 2-3, 182-190, https://doi.org/10.1016/S0379-0738(01)00548-5 . [all data]