2,6,10,14-Tetramethyl-7-(3-methylene-pent-4-enyl)-pentadeca-5,9-diene

Normal alkane RI, non-polar column, temperature ramp

View large format table.

Column type Active phase I Reference Comment
CapillaryHP-12157.Allard, Belt, et al., 2001He, 5. K/min, 300. C @ 10. min; Column length: 12. m; Column diameter: 0.2 mm; Tstart: 40. C
CapillaryHP-52159.Allard, Belt, et al., 2001He, 5. K/min, 300. C @ 10. min; Column length: 25. m; Column diameter: 0.2 mm; Tstart: 40. C

Normal alkane RI, polar column, temperature ramp

View large format table.

Column type Active phase I Reference Comment
CapillaryDB-Wax2267.Allard, Belt, et al., 2001He, 5. K/min, 200. C @ 10. min; Column length: 15. m; Column diameter: 0.32 mm; Tstart: 40. C

References

Allard, Belt, et al., 2001
Allard, W.G.; Belt, S.T.; Massé, G.; Naumann, R.; Robert, J.-M.; Rowland, S., Tetra-unsaturated sesterterpenoids (Haslenes) from Haslea ostrearia and related species, Phytochemistry, 2001, 56, 8, 795-800, https://doi.org/10.1016/S0031-9422(00)00429-5 . [all data]