(E)-Cyclodecene, 3-methyl

Kovats' RI, non-polar column, isothermal

View large format table.

Column type Active phase Temperature (C) I Reference Comment
CapillarySqualane100.1166.Schomburg, 1967Ar; Column length: 100. m

References

Schomburg, 1967
Schomburg, G., Struktur und Retentionsverhalten von Offenkettigen und Cyclischen Kohlenwasserstoffen und Deren Einfacher Substitutionsprodukte, Anal. Chim. Acta., 1967, 38, 45-64, https://doi.org/10.1016/S0003-2670(01)80560-2 . [all data]