4-Penten-1-ol, trichloroacetate

Van Den Dool and Kratz RI, non-polar column, temperature ramp

View large format table.

Column type Active phase I Reference Comment
CapillarySE-301228.Korhonen, 1984N2, 6. K/min; Column length: 25. m; Column diameter: 0.30 mm; Tstart: 50. C

Van Den Dool and Kratz RI, polar column, temperature ramp

View large format table.

Column type Active phase I Reference Comment
CapillaryOV-3511637.Korhonen, 1984N2, 6. K/min; Column length: 25. m; Column diameter: 0.32 mm; Tstart: 50. C

References

Korhonen, 1984
Korhonen, I.O.O., Gas-Liquid Chromatographic Analyses. XXVI. Separation of Unsaturated Alcohols and Their Acetyl and Haloacetyl Derivatives on Capillary Columns Coated with SE-30 and OV-351, J. Chromatogr., 1984, 288, 329-346, https://doi.org/10.1016/S0021-9673(01)93710-0 . [all data]