8-(4-Methylpentene-3-yl) spiro[4.5]decene-7-one-1

Kovats' RI, non-polar column, isothermal

View large format table.

Column type Active phase Temperature (C) I Reference Comment
CapillaryMethyl Silicone200.1846.0Boneva and Balbolov, 199550. m/0.25 mm/1. μm, N2
CapillaryMethyl Silicone210.1853.2Boneva and Balbolov, 199550. m/0.25 mm/1. μm, N2

Kovats' RI, polar column, isothermal

View large format table.

Column type Active phase Temperature (C) I Reference Comment
CapillaryCarbowax 20M170.2374.4Boneva and Balbolov, 1995N2; Column length: 50. m; Column diameter: 0.25 mm
CapillaryCarbowax 20M180.2387.3Boneva and Balbolov, 1995N2; Column length: 50. m; Column diameter: 0.25 mm

References

Boneva and Balbolov, 1995
Boneva, S.; Balbolov, E., Capillary gas chromatography of aromatic bicyclic and tricyclic spiro ketones, Chromatographia, 1995, 41, 9/10, 594-598, https://doi.org/10.1007/BF02688091 . [all data]