Phenytoin, M(HO-), AC

Kovats' RI, non-polar column, temperature ramp

View large format table.

Column type Active phase I Reference Comment
PackedOV-1012775.Maurer, 1990N2, Chromosorb G HP, 100. C @ 3. min, 30. K/min, 310. C @ 5. min; Column length: 0.60 m
PackedOV-1012775.Maurer, 1990, 2N2, Chromosorb G HP, 100. C @ 3. min, 30. K/min, 310. C @ 5. min; Column length: 0.6 m

References

Maurer, 1990
Maurer, H.H., Identification of antiarrhythmic drugs and their metabolites in urine, Arch. Toxicol., 1990, 64, 3, 218-230, https://doi.org/10.1007/BF02010728 . [all data]

Maurer, 1990, 2
Maurer, H.H., Detection of anticonvulsants and their metabolites in urine within a general unknown analysis procedure using computerized gas chromatography-mass spectrometry, Arch. Toxicol., 1990, 64, 7, 554-561, https://doi.org/10.1007/BF01971834 . [all data]