11,18-Diethyl-octacosane

Kovats' RI, non-polar column, isothermal

View large format table.

Column type Active phase Temperature (C) I Reference Comment
PackedSE-30270.3008.Freche and Grenier-Loustalot, 1982Chromosorb NAW

References

Freche and Grenier-Loustalot, 1982
Freche, P.; Grenier-Loustalot, M.-F., Identification d'alcanes lourds (modèles de polyéthylène basse densite) par leur tension de vapeur. Corrélation avec la chromatographie en phase gazeuse, J. Chromatogr., 1982, 238, 2, 327-334, https://doi.org/10.1016/S0021-9673(00)81318-7 . [all data]