Allyl isobutyl sulfide

Normal alkane RI, non-polar column, temperature ramp

View large format table.

Column type Active phase I Reference Comment
CapillaryDB-5MS1063.Zoghbi, Andrade, et al., 200230. m/0.25 mm/0.25 μm, He, 3. K/min; Tstart: 60. C; Tend: 270. C

References

Zoghbi, Andrade, et al., 2002
Zoghbi, M.G.B.; Andrade, E.H.A.; Maia, J.G.S., Volatile constituents from Adenocalymma alliaceum Miers and Petiveria alliacea L., two medicinal herbs of the Amazon, Flavour Fragr. J., 2002, 17, 2, 133-135, https://doi.org/10.1002/ffj.1051 . [all data]