2-ethenyl-3-ethyl-5-methylpyrazine

Normal alkane RI, non-polar column, temperature ramp

View large format table.

Column type Active phase I Reference Comment
CapillaryDB-51172.Sanz, Czerny, et al., 200230. m/0.32 mm/0.25 μm, He, 40. C @ 2. min, 6. K/min, 230. C @ 5. min

Normal alkane RI, polar column, temperature ramp

View large format table.

Column type Active phase I Reference Comment
CapillaryDB-FFAP1577.Sanz, Czerny, et al., 200230. m/0.32 mm/0.25 μm, He, 40. C @ 2. min, 6. K/min, 230. C @ 5. min

Normal alkane RI, polar column, custom temperature program

View large format table.

Column type Active phase I Reference Comment
CapillaryDB-FFAP1585.Mayer and Grosch, 200130. m/0.32 mm/0.25 μm, He; Program: 35 0C (2 min) 40 K/min -> 60 0C (1 min) 6 K/min -> 240 0C

References

Sanz, Czerny, et al., 2002
Sanz, C.; Czerny, M.; Cid, C.; Schieberle, P., Comparison of potent odorants in a filtered coffee brew and in an instant coffee beverage by aroma extract dilution analysis (AEDA), Eur. Food Res. Technol., 2002, 214, 4, 299-302, https://doi.org/10.1007/s00217-001-0459-9 . [all data]

Mayer and Grosch, 2001
Mayer, F.; Grosch, W., Aroma simulation on the basis of the odourant composition of roasted coffee headspace, Flavour Fragr. J., 2001, 16, 3, 180-190, https://doi.org/10.1002/ffj.975 . [all data]