(E,E,E)-2,4,6-dodecatrienal

Van Den Dool and Kratz RI, non-polar column, custom temperature program

View large format table.

Column type Active phase I Reference Comment
CapillarySE-541600.Blank, Lin, et al., 200130. m/0.32 mm/0.25 μm, He; Program: 20C => 70C/min => 50C => 4C/min => 180C => 10C/min => 240C(10min)

Van Den Dool and Kratz RI, polar column, custom temperature program

View large format table.

Column type Active phase I Reference Comment
CapillaryFFAP2216.Blank, Lin, et al., 200130. m/0.32 mm/0.25 μm, He; Program: 20C(2min) => 40C/min => 50C(2min) => 4C/min => 150C => 10C/min => 240C(15min)

References

Blank, Lin, et al., 2001
Blank, I.; Lin, J.; Arce Vera, F.; Welti, D.H.; Fay, L.B., Identification of potent odorants formed by autoxidation of arachidonic acid: structure elucidation and synthesis of (E,Z,Z)-2,4,7-tridecatrienal, J. Agric. Food Chem., 2001, 49, 6, 2959-2965, https://doi.org/10.1021/jf010160+ . [all data]