4-tert-Butylphenol, isoBOC

Van Den Dool and Kratz RI, non-polar column, custom temperature program

View large format table.

Column type Active phase I Reference Comment
CapillaryDB-51727.Kim and Kim, 200030. m/0.25 mm/0.25 μm, He; Program: 60C(0.7min) => 30C/min => 150C => 5C/min => 280C

References

Kim and Kim, 2000
Kim, K.-R.; Kim, H., Gas chromatographic profiling and screening for phenols as isobutoxycarbonyl derivatives in aqueous samples, J. Chromatogr. A, 2000, 866, 1, 87-96, https://doi.org/10.1016/S0021-9673(99)01068-7 . [all data]