2,7-Dilfuoro DBD

Normal alkane RI, non-polar column, temperature ramp

View large format table.

Column type Active phase I Reference Comment
CapillaryDB-51505.Haffer, Conrad, et al., 199630. m/0.25 mm/0.25 μm, He, 50. C @ 5. min, 3. K/min, 260. C @ 5. min

References

Haffer, Conrad, et al., 1996
Haffer, U.; Conrad, D.; Rotard, W., Contributions to the GC-MS-analysis of polyfluorinated dibenzo-p-dioxins (PFDD), Fresenius J. Anal. Chem., 1996, 354, 359-361. [all data]