2-pinen-5-ol

Normal alkane RI, non-polar column, temperature ramp

View large format table.

Column type Active phase I Reference Comment
CapillaryDB-11106.Nishimura, 199560. m/0.25 mm/0.25 μm, He, 3. K/min; Tstart: 80. C; Tend: 210. C

References

Nishimura, 1995
Nishimura, O., Identification of the characteristic odorants in fresh rhizomes of ginger (Zingiber officinale Roscoe) using aroma extract dilution analysis and modified multidimensional gas chromatography-mass spectroscopy, J. Agric. Food Chem., 1995, 43, 11, 2941-2945, https://doi.org/10.1021/jf00059a031 . [all data]