4-(hydroxymethyl)-1,2-dithiepane

Normal alkane RI, non-polar column, temperature ramp

View large format table.

Column type Active phase I Reference Comment
CapillaryDB-11274.Yu, Wu, et al., 199460. m/0.25 mm/1. μm, He, 40. C @ 5. min, 2. K/min, 260. C @ 60. min

References

Yu, Wu, et al., 1994
Yu, T.-H.; Wu, C.-M.; Rosen, R.T.; Hartman, T.G.; Ho, C.-T., Volatile compounds in generated from thermal degradation of alliin and deoxyalliin in an aqueous solution, J. Agric. Food Chem., 1994, 42, 1, 146-153, https://doi.org/10.1021/jf00037a026 . [all data]