Piperidine, 1-butyl-3-methyl

Kovats' RI, non-polar column, isothermal

View large format table.

Column type Active phase Temperature (C) I Reference Comment
CapillaryOV-101110.1080.Zhuravleva, Golovnya, et al., 199350. m/0.30 mm/0.40 μm, He

Kovats' RI, polar column, isothermal

View large format table.

Column type Active phase Temperature (C) I Reference Comment
CapillaryPEG-40M110.1184.Zhuravleva, Golovnya, et al., 199350. m/0.30 mm/0.40 μm, He

References

Zhuravleva, Golovnya, et al., 1993
Zhuravleva, I.L.; Golovnya, R.V.; Kuzmenko, T.E., The regularities of the gas-chromatographic behavior of methyl-substituted N-alkylpiperidines, Russ. Chem. Bull. (Engl. Transl.), 1993, 42, 10, 1677-1679, https://doi.org/10.1007/BF00697038 . [all data]